Home > Not Found > Nmake Fatal Error U1052

Nmake Fatal Error U1052


So, cd C:\Development\wireshark nmake -f Makefile.nmake verify_tools Regards Kurt link answered 02 Jun '14, 12:37 Kurt Knochner ♦ 24.4k●10●35●228 accept rate: 15% edited 02 Jun '14, 12:38 Thanks Kurt for your Format For Printing -XML -JSON - Clone This Bug -Top of page Home | New | Browse | Search | [help] | Reports | Product Dashboard Privacy Notice | Legal Terms Here i get this error: C:\Development\wireshark>nmake -f Makefile.nmake Verify_tools Microsoft (R) Program Maintenance Utility Version 10.00.30319.01 Copyright (C) Microsoft Corporation. link answered 21 Aug '11, 07:41 one step 16●2●2●4 accept rate: 0% edited 21 Aug '11, 10:40 Guy Harris ♦♦ 16.0k●2●32●180 Right. http://themedemo.net/not-found/nmake-error-u1052.html

How long could the sun be turned off without overly damaging planet Earth + humanity? We appreciate your feedback. Comment 9 Daniel Holbert [:dholbert] (PTO Oct 21-25) 2009-04-19 11:05:47 PDT (In reply to comment #8) Yup, that's exactly what happened with me. :) Phil, thanks for clarifying the actual situation more stack exchange communities company blog Stack Exchange Inbox Reputation and Badges sign up log in tour help Tour Start here for a quick overview of the site Help Center Detailed

Fatal Error U1052: File 'win32.mak' Not Found

Win32: Step-by-Step Guide", but I'm having trouble with nmake -f Makefile.nmake verify_tools. Codegolf the permanent Defining a function via pattern matching with SeriesData Is it legal to bring board games (made of wood) to Australia? It's free!

Try using !INCLUDE instead. We appreciate your feedback. Terms Privacy Opt Out Choices Advertise Get latest updates about Open Source Projects, Conferences and News. Win32.mak Visual Studio 2013 See ASP.NET Ajax CDN Terms of Use – http://www.asp.net/ajaxlibrary/CDN.ashx. ]]> Developer Network Developer Network Developer Sign in MSDN subscriptions

If nmake can't find win32.mak then that's a strong indication that your build environment isn't set up correctly. Makefile(3) : Fatal Error U1052: File 'win32.mak' Not Found Please don't fill out this field. Bar to add a line break simply add two spaces to where you would like the new line to be. https://support.microsoft.com/en-us/kb/133249 It's free!

This documentation is archived and is not being maintained. Win32.mak Visual Studio 2015 The vcvarsall batch files are additive, so if you run the script again (from the same shell), particularly if you change from x86 to x64 (or vice-versa) your environment will grow Nonparametric clustering (in the sense: free of input arguments such as k of clusters) Hexagonal minesweeper Sharepoint development methods and tools Were students "forced to recite 'Allah is the only God'" Comment 21 Ted Mielczarek [:ted.mielczarek] 2011-04-28 08:45:58 PDT *** Bug 416125 has been marked as a duplicate of this bug. *** Note You need to log in before you can comment

Makefile(3) : Fatal Error U1052: File 'win32.mak' Not Found

Dev centers Windows Office Visual Studio Microsoft Azure More... https://ask.wireshark.org/questions/33297/makefilenmake-error Browse other questions tagged visual-studio makefile tbb nmake or ask your own question. Fatal Error U1052: File 'win32.mak' Not Found Join them; it only takes a minute: Sign up nmake or makefile cannot find directory up vote 0 down vote favorite Hello I'm trying to build intel's tbb (threaded building blocks) Ntwin32 Mak Not Found Thanks for your help anyway :) –Prof Feb 15 '14 at 23:56 add a comment| up vote 0 down vote accepted The answer was simple one - the file seems to

Comment 4 Justin Dolske [:Dolske] 2008-12-24 21:27:04 PST Hiding the error from from the build log would really be helpful, when a build fails for other reasons you get a log asked 2 years ago viewed 784 times active 2 years ago Visit Chat Related 5MS nmake equivalent of $(MAKECMDGOALS)0Recursive nmake target6nmake Makefile to Place object files in a separate directory784What is Where am I going wrong? Riverbed is Wireshark's primary sponsor and provides our funding. Win32.mak Download

in "DLL Unicode Debug" build, with "cannot open >>> file '..\..\lib\vc_dll\wxbase28ud_odbc.lib", even though odbc is on in >>> the build Config Mgr. >>> >>> Yes, I could probably spend a few You need to see four of them. All Rights Reserved. Source I point visual studio's command prompt to the directory of extraction, where there is a makefile.

set Please don't post a screenshot of the window. Include Ntwin32 Mak Foo 2. Thanks Thomas visual-studio makefile tbb nmake share|improve this question asked Feb 15 '14 at 14:23 Prof 76621028 add a comment| 3 Answers 3 active oldest votes up vote 2 down vote

It was a cannibalisation and I don't think it was ever tested.

Maybe this updated bug summary is enough in that department) Comment 10 Ted Mielczarek [:ted.mielczarek] 2009-04-20 08:29:08 PDT I have looked at the CRT makefile and I have no idea where All rights reserved. Is this a valid way to prove this modified harmonic series diverges? という used right before comma: What does this mean, and how is it grammatically possible? Win32.mak Not Found Visual Studio 2012 Attachments hack build-crt.py to elide these errors from the log (1.08 KB, patch) 2009-04-21 04:23 PDT, Ted Mielczarek [:ted.mielczarek] benjamin: review+ christian: approval1.9.1.12- Details | Diff | Splinter Review View All

make[5]: *** [export] Error 2 make[4]: *** [export_tier_js] Error 2 make[3]: *** [tier_js] Error 2 make[2]: *** [default] Error 2 make[1]: *** [build] Error 2 make: *** [profiledbuild] Error 2 The makefile.nmake nmake wireshark asked 02 Jun '14, 12:28 aman 36●15●16●20 accept rate: 0% closed 02 Jun '14, 14:07 grahamb ♦ 17.1k●3●28●185 The question has been closed for the following reason "Duplicate Developer Network Developer Network Developer Sign in MSDN subscriptions Get tools Downloads Visual Studio MSDN subscription access SDKs Trial software Free downloads Office resources SharePoint Server 2013 resources SQL Server 2014 But, that is no longer the case... >>>>> >>>>> Leland >>> >>> Thanks, Leland.

Dev centers Windows Office Visual Studio Microsoft Azure More... I doubt it! From the command prompt, use the set command to define environment variables.For example:set cintoolsdir=c:\Progra~1\Nation~1\LabVIE~1.1\cintools Related Links: Product Manual: Using External Code in LabVIEW (Revision 6.1) Attachments: Report Date: 05/07/1996 Last Updated: Did you, really, really, really, follow the developers guide by the word? (02 Jun '14, 12:45) Kurt Knochner ♦ ya I followed as per the guide, but getting strange errors since

Last Comment Bug468447 - Nonfatal "NMAKE : fatal error U1052: file 'makefile.sub' not found" in every single log masks real errors in failure logs Summary: Nonfatal "NMAKE : fatal error U1052: YMMV. >>> >>> Not for me. >>> >>> And yep, we have agreed to stick with wx 2.8.12 for Audacity 2.1. >>> >>> >>> >>>> >>>> HTH >>> >>> Sadly, not Then you will found Wind32.mak file in C:\Program Files\Microsoft SDKs\Windows\v7.0\Include. You may need to unselect both C++ compiler and redistributable package from the install component for the install to work.

Riverbed is Wireshark's primary sponsor and provides our funding. For more details see Persona Deprecated. Learning resources Microsoft Virtual Academy Channel 9 MSDN Magazine Community Forums Blogs Codeplex Support Self support Programs BizSpark (for startups) Microsoft Imagine (for students) United States (English) Newsletter Privacy & cookies It's possible we could patch the nmake Makefiles to avoid this, but I have not been motivated to fix it.

This is a bodge that I committed >>>> to compile.txt. Please refer to our Privacy Policy or Contact Us for more details You seem to have CSS turned off. What is the correct plural of "Training"? If it was installed correctly, running vcvars32.bat would add the following to the environment: DevEnvDir=C:\Program Files (x86)\Microsoft Visual Studio 10.0\Common7\IDE\ Framework35Version=v3.5 FrameworkDir=C:\Windows\Microsoft.NET\Framework\ FrameworkDIR32=C:\Windows\Microsoft.NET\Framework\ FrameworkVersion=v4.0.30319 FrameworkVersion32=v4.0.30319 INCLUDE=c:\Program Files (x86)\Microsoft Visual Studio 10.0\VC\INCLUDE;c:\Program

I think some fix is needed here, whether it's hiding the error from the parser, or fixing the parser to ignore the error. (In the meantime, we should educate people, perhaps SQL Server: Is altering collation on existing database safe? Opportunities for recent engineering grads. Please don't fill out this field.

NMAKE interpreted it as a drive specification.A colon did not follow an inference rule.A macro definition was not followed by an equal sign.A character followed a backslash (\) that was used My wild guess would be a NAS issue (locking?). share|improve this answer answered Feb 15 '14 at 14:28 MadScientist 27k32240 Didn't seem to work unfortunately, generated: ./build/common.inc(28) : fatal error U1034: syntax error : separator missing Stop. –Prof I have seen a lot of forced and periodic clobbers on the TM tree. 17:31:08 < nagios> [27] moz2-linux-slave12.build:disk - /builds is WARNING: DISK WARNING - free space: /builds 1553 MB