Home > Nss Error > Nss Error Code 8174

Nss Error Code 8174


PR_DIRECTORY_OPEN_ERROR: The directory could not be opened. http://rhn.redhat.com/errata/RHBA-2011-1514.html Note You need to log in before you can comment on or make changes to this bug. Another token may also have been inserted into the same slot. SSL_ERROR_US_ONLY_SERVER -12287 "Unable to communicate securely. check over here

SSL_ERROR_SSL_DISABLED: Cannot connect: SSL is disabled. SEC_ERROR_CERT_USAGES_INVALID -8154 Certificate usages field is invalid. This probably indicates a flaw in the remote peer's implementation. SEC_ERROR_JS_INVALID_MODULE_NAME: Invalid module name.

Nss Error 5938

SSL_ERROR_DECOMPRESSION_FAILURE: SSL received a compressed record that could not be decompressed. To prevent using wrong cacert x for Y, I will try to avoid it: LDAPTLS_REQCERT=never ldapsearch -x -H ldaps://Y ... (fail) but it won't work, AFAIK there is no workaround as SEC_ERROR_CERT_NO_RESPONSE -8163 Certificate library: no response.

It would be nice to have some way how to > "disable" such TLS_CACERT. Comment 12 by [email protected], Sep 1 2009 Processing hliauw: don't build everything; just build the chrome target Comment 13 by [email protected], Sep 1 2009 Processing hliauw: you can apply the patch SSL_ERROR_RX_UNEXPECTED_CLIENT_HELLO: SSL received an unexpected Client Hello handshake message. Nss Error Code 5938 This indicates a configuration error on the local server.

SEC_ERROR_UNSUPPORTED_KEYALG -8144 Unsupported or unknown key algorithm. Nss Error Code 5961 No additional filenames may be added. SSL_ERROR_MD5_DIGEST_FAILURE: MD5 digest function failed. SEC_ERROR_UNKNOWN_CRITICAL_EXTENSION -8151 Certificate contains unknown critical extension.

SSL_ERROR_BAD_MAC_ALERT: SSL peer reports incorrect Message Authentication Code. Nss Error -5938 Pr_end_of_file_error Thanks a lot.. I assume this is a workaround by not usingdatabase at all. PR_UNLOAD_LIBRARY_ERROR: Failure to unload dynamic library.

Nss Error Code 5961

MAC algorithm not supported. Comment 4 by [email protected], Sep 1 2009 Processing Actually, I haven't been able to open the link. Nss Error 5938 SEC_ERROR_OCSP_UNKNOWN_RESPONSE_TYPE: The OCSP response cannot be fully decoded; it is of an unknown type. What Is Nss Error You only need the NSS databases for: - adding a new root CA certificate that you want to trust, or - SSL client authentication (not supported by Chrome Linux yet) -

PR_FILESYSTEM_MOUNTED_ERROR: Cannot delete or rename a file object while the file system is busy. check my blog Functionality as documented in the man page makes sense, the behavior observed by Ondrej does not. Save the patch as nss_init_nodb.txt 2. SEC_ERROR_CRL_ALREADY_EXISTS: CRL already exists. Nss Error Codes

SEC_ERROR_UNKNOWN_OBJECT_TYPE: Unknown object type specified. Why did WW-II Prop aircraft have colored prop tips What to do with my pre-teen daughter who has been out of control since a severe accident? SEC_ERROR_BAD_NICKNAME: Certificate nickname already in use. http://themedemo.net/nss-error/nss-error-code-20892.html SEC_ERROR_EXTENSION_VALUE_INVALID: Certificate extension value is invalid.

Error initializing NSS: Couldn't retrieve error [18041:18044:19507177740:FATAL:/home/hmuliawa/chroSrc/chromiumSVN/src/base/nss_init.cc(80)] Check failed: false. Curl Nss Error -5938 SSL_ERROR_UNSUPPORTED_HASH_ALGORITHM: Unsupported hash algorithm used by TLS peer. The > reasoning behing that is given by man page: > > never The client will not request or check any server certificate. > I asked upstream developers about this situation

If the configuration specifies to never request certificates, the software should never request (or check for, as they're not going to be requested anyway) certificates.

You should only need to install libsoftokn3.so, libfreebl3.so, and libsqlite3.so. XP_SEC_FORTEZZA_BAD_CARD: Fortezza card has not been properly initialized. SEC_ERROR_NO_TOKEN -8127 The security card or token does not exist, needs to be initialized, or has been removed. Nss Error 8018 SSL_ERROR_SESSION_KEY_GEN_FAILURE: Client failed to generate session keys for SSL session.

It is a generic error, used when none of the other more specific error codes defined in this file applies. PR_IO_TIMEOUT_ERROR: I/O operation timed out. SEC_ERROR_INVALID_ALGORITHM: security library: invalid algorithm. have a peek at these guys If any revisions are required, please edit the "Technical Notes" field accordingly.

SEC_ERROR_OLD_KRL -8082 New KRL is not later than the current one. SEC_ERROR_ADDING_CERT: Error adding certificate to database. PR_IO_PENDING_ERROR: I/O operation on busy file descriptor. SSL_ERROR_RX_UNEXPECTED_CHANGE_CIPHER: SSL received an unexpected Change Cipher Spec record.

SEC_ERROR_CRL_INVALID: New CRL has an invalid format. PR_UNKNOWN_ERROR: Some unknown error has occurred. SEC_ERROR_UNSUPPORTED_EC_POINT_FORM: Unsupported elliptic curve point form. Please run ident /usr/lib/libsoftokn3.so I bet it says "NSS 3.11.4".

SEC_ERROR_OCSP_UNAUTHORIZED_REQUEST: The OCSP server has refused this request as unauthorized. SSL_ERROR_TX_RECORD_TOO_LONG: SSL attempted to send a record that exceeded the maximum permissible length. SEC_ERROR_PKCS12_UNABLE_TO_EXPORT_KEY -8096 Unable to export.